{"text_format":"3","workbook":"xlsx","n_sheets":6,"sheets":["版本記錄","系統功能列表","資料表及主鍵","資料欄位列表","工作表2","memo"],"not_rendered":{"defined_names":3},"read":"whole","date_system":"1900"}

{"sheet":"版本記錄","index":0,"n_rows":5,"n_cols":2,"rows_kept":5}
["日期","主要更新項目"]
["2023-07-15","建立各項資料表/欄位規格"]
[null,"新增資料表（5個資料表）及欄位，先記錄欄位，規格後補"]
["2023-07-30","完成新資料表/欄位的規格說明"]
["2024-08-15","新增欄位:信眾SHA(電話+身份證號)"]

{"sheet":"系統功能列表","index":1,"n_rows":36,"n_cols":2,"rows_kept":36}
["子系統","功能模組"]
["公告","公告分類管理"]
[null,"公告管理"]
[null,"公告檢視"]
["信眾","信眾資料"]
[null,"信眾匯入"]
["活動","活動主類型"]
[null,"活動詳細分類"]
[null,"活動管理"]
["報名","報名管理"]
[null,"報到名單"]
["專案","類別管理"]
[null,"專案管理"]
[null,"贊助報告"]
["基本資料","品項分類管理"]
[null,"品項管理"]
[null,"套表列印設定"]
["掛單","房間管理"]
["帳務","收支項目維護"]
[null,"收支帳戶維護"]
[null,"收支管理"]
["庫存","倉庫資料維護"]
[null,"庫存管理"]
["人事","人員匯入"]
[null,"人員組別管理"]
[null,"職稱管理"]
[null,"人員管理"]
[null,"考勤"]
["權限","使用者登錄"]
[null,"使用者管理"]
[null,"群組資料"]
[null,"群組登錄"]
[null,"變更管理密碼"]
[null,"登入記錄查詢"]
["選項","選項排序"]
[null,"後台設定"]

{"sheet":"資料表及主鍵","index":2,"n_rows":51,"n_cols":6,"rows_kept":51}
["所屬系統","資料表中文名","資料表名稱","主索引欄位","資料表說明","待辦工作"]
["公告","公告分類","news_kind","num","內部公告分類"]
["公告","公告資料主檔","news","num","內部公告資料"]
["公告","公告資料-附件檔","news_files","num, news_id","內部公告附件"]
["信眾","信眾資料","followers","num","信眾資料, 主要供報名用"]
["活動","活動主類型","activity_category_kind","num","基本的活動大分類, 如: 法會, 慈善"]
["活動","活動詳細分類","activity_kind","num","定義常用的活動類型, 包含: 舉辦日期, 相關品項等資訊"]
["活動","活動分類-相關品項","activity_kind_detail","num","記錄該活動類型的相關報名項目"]
["活動","活動主檔","activity","num","單次舉辦的活動, 可依據活動詳細分類定義內容"]
["活動","活動主檔-相關品項","activity_relating","num","該活動可報名的品項, 如: 牌位, 打齋, 掛單"]
["活動","活動主檔-相關備品","activity_spares","num","管理該活動需使用的備品品項"]
["報名","報名主檔","pro_order","order_no","信眾參加活動的報名資料, 也可用於非活動期間的一般報名、贊助"]
["報名","報名明細檔","pro_order_detail","num","報名的詳細品項, 如: 牌位, 打齋, 掛單"]
["報名","(新1)報名收款記錄","pro_order_record","num","(新資料表)"]
["報名","活動報到檔","activity_check","num","活動期間的每日報到記錄"]
["專案","專案類別管理","project_kind","num","專案分類"]
["專案","專案管理","project","num","對應記錄執行過程的報名項目做專案記錄管理, 用於對贊助者報告"]
["專案","專案管理-活動資料","project_sub","num","記錄應向贊助者報告的執行記錄, 也可定義專案SOP"]
["基本資料","品項管理主檔","actItem","num","定義所有類型的品項基本資料: 報名, 掛單, 備品, 庫存品"]
["基本資料","品項相關文件檔","actItem_files","num","定義該品項相關的表單套印設計"]
["基本資料","品項分類管理","actItem_kind","num","定義品項分類"]
["基本資料","套表列印設定","files","num","表單套印設計, 以HTML加上定義的報名相關資訊欄位"]
["掛單","房間管理主檔","bed_kind","num","管理:寮房的樓層/房間"]
["掛單","房間管理-床位明細","bed_kind_detail","num","管理:寮房的床位"]
["掛單","報名-掛單主檔","bed_order","bed_order_no","附屬於報名系統, 記錄掛單人員, 日期, 狀態"]
["掛單","報名-掛單明細","bed_order_detail","num","記錄掛單每日的:日期, 床位"]
["帳務","收支管理主檔","accounting","num","記錄日常收支作業, 類似存摺記錄"]
["帳務","收支附件檔","accounting_files","num","日常收支憑證圖檔, 如: 發票, 收據..等"]
["帳務","收支項目維護","accounting_kind","num","定義收支項目名稱, 及對應會計科目編號"]
["帳務","收支帳戶維護","accounting_kind2","num","定義帳戶資料, 及對應會計科目編號"]
["庫存","倉庫資料主檔","stock_kind","num","定義庫存品存放位置"]
["庫存","庫存管理主檔","stock","num","記錄物品進出記錄"]
["庫存","庫存管理-檔案附件","stock_files","num","倉庫憑證圖檔, 如: 簽收單, 借據..等"]
["庫存","庫存異動原因","stock_reason","num","(新資料表)"]
["庫存","(新3)供應商主檔","supplier","num","(新資料表)"]
["庫存","供應商類型","supplier_kind","num","(新資料表)"]
["人事","人員主檔","member","num","工作人員基本資料建檔"]
["人事","考勤","member_check","num","工作人員出勤記錄"]
["人事","人員組別管理","member_group","num","部門組別資料定義"]
["人事","職稱管理","member_title","num","人員職稱基本定義"]
["權限","使用者管理","admin","num","登入系統的使用者帳號"]
["權限","群組資料","admin_group","g_name","權限群組資料, 使用權限是基於群組設定的"]
["權限","登入記錄查詢","admin_log","num","使用者登入或使用系統的記錄"]
["選項","選項設定檔","item","num","系統主選單管理"]
["選項","後台設定檔","company","num","系統基本資料檔"]
["選項","縣市資料檔","PostCity","city","縣市資料"]
["選項","縣市-郵遞區號檔","PostNumber","ID","行政區及郵遞區號資料"]
["基本資料","品項層級檔","act_bom","num","2層式:功德主/牌位結構(BOM)"]
["信眾","稱謂資料檔","appellation","num","稱謂資料檔"]
["基本資料","國家資料檔","country","ID","國家資料檔"]
["信眾","信眾牌位檔","followers_tablet","num","信眾預設牌位標題"]

{"sheet":"資料欄位列表","index":3,"n_rows":457,"n_cols":11,"rows_kept":457}
["所屬系統","資料表中文名","TABLE.COL","資料表名稱","欄位名稱","資料型態","最大長度","可為空值","中文名稱(*必填)","值 / 關聯查詢","欄位說明"]
[{"$f":"_xlfn.XLOOKUP(D2,資料表及主鍵!C:C,資料表及主鍵!A:A)","v":"帳務"},{"$f":"_xlfn.XLOOKUP(D2,資料表及主鍵!C:C,資料表及主鍵!B:B)","v":"收支管理主檔"},{"$f":"D2&\".\"&E2","v":"accounting.num"},"accounting","num",null,null,"否","自動編號"]
[{"$f":"_xlfn.XLOOKUP(D3,資料表及主鍵!C:C,資料表及主鍵!A:A)","v":"帳務"},{"$f":"_xlfn.XLOOKUP(D3,資料表及主鍵!C:C,資料表及主鍵!B:B)","v":"收支管理主檔"},"accounting.uptime","accounting","uptime",null,null,"是","單據日期 *"]
[{"$f":"_xlfn.XLOOKUP(D4,資料表及主鍵!C:C,資料表及主鍵!A:A)","v":"帳務"},{"$f":"_xlfn.XLOOKUP(D4,資料表及主鍵!C:C,資料表及主鍵!B:B)","v":"收支管理主檔"},"accounting.reg_time","accounting","reg_time","datetime",null,"是","登記時間"]
[{"$f":"_xlfn.XLOOKUP(D5,資料表及主鍵!C:C,資料表及主鍵!A:A)","v":"帳務"},{"$f":"_xlfn.XLOOKUP(D5,資料表及主鍵!C:C,資料表及主鍵!B:B)","v":"收支管理主檔"},"accounting.category","accounting","category",null,null,"是","收支類別 *","收入, 支出"]
[{"$f":"_xlfn.XLOOKUP(D6,資料表及主鍵!C:C,資料表及主鍵!A:A)","v":"帳務"},{"$f":"_xlfn.XLOOKUP(D6,資料表及主鍵!C:C,資料表及主鍵!B:B)","v":"收支管理主檔"},"accounting.kind","accounting","kind",null,null,"是","收支項目 *","查詢:收支項目"]
[{"$f":"_xlfn.XLOOKUP(D7,資料表及主鍵!C:C,資料表及主鍵!A:A)","v":"帳務"},{"$f":"_xlfn.XLOOKUP(D7,資料表及主鍵!C:C,資料表及主鍵!B:B)","v":"收支管理主檔"},"accounting.kind2","accounting","kind2",null,null,"是","收支帳戶 *","查詢:收支帳戶"]
[{"$f":"_xlfn.XLOOKUP(D8,資料表及主鍵!C:C,資料表及主鍵!A:A)","v":"帳務"},{"$f":"_xlfn.XLOOKUP(D8,資料表及主鍵!C:C,資料表及主鍵!B:B)","v":"收支管理主檔"},"accounting.price","accounting","price",null,null,"是","未稅金額 *"]
[{"$f":"_xlfn.XLOOKUP(D9,資料表及主鍵!C:C,資料表及主鍵!A:A)","v":"帳務"},{"$f":"_xlfn.XLOOKUP(D9,資料表及主鍵!C:C,資料表及主鍵!B:B)","v":"收支管理主檔"},"accounting.tax","accounting","tax",null,null,"是","稅額 *"]
[{"$f":"_xlfn.XLOOKUP(D10,資料表及主鍵!C:C,資料表及主鍵!A:A)","v":"帳務"},{"$f":"_xlfn.XLOOKUP(D10,資料表及主鍵!C:C,資料表及主鍵!B:B)","v":"收支管理主檔"},"accounting.demo","accounting","demo",null,"MAX","是","備註"]
[{"$f":"_xlfn.XLOOKUP(D11,資料表及主鍵!C:C,資料表及主鍵!A:A)","v":"帳務"},{"$f":"_xlfn.XLOOKUP(D11,資料表及主鍵!C:C,資料表及主鍵!B:B)","v":"收支管理主檔"},"accounting.mem_num","accounting","mem_num",null,null,"是","內部負責人 *","查詢:人員"]
[{"$f":"_xlfn.XLOOKUP(D12,資料表及主鍵!C:C,資料表及主鍵!A:A)","v":"帳務"},{"$f":"_xlfn.XLOOKUP(D12,資料表及主鍵!C:C,資料表及主鍵!B:B)","v":"收支管理主檔"},"accounting.debtor","accounting","debtor",null,40,"是","外部負責人"]
[{"$f":"_xlfn.XLOOKUP(D13,資料表及主鍵!C:C,資料表及主鍵!A:A)","v":"帳務"},{"$f":"_xlfn.XLOOKUP(D13,資料表及主鍵!C:C,資料表及主鍵!B:B)","v":"收支管理主檔"},"accounting.activity_num","accounting","activity_num",null,null,"是","相關活動","查詢:活動主檔"]
[{"$f":"_xlfn.XLOOKUP(D14,資料表及主鍵!C:C,資料表及主鍵!A:A)","v":"帳務"},{"$f":"_xlfn.XLOOKUP(D14,資料表及主鍵!C:C,資料表及主鍵!B:B)","v":"收支管理主檔"},"accounting.excerpt","accounting","excerpt",null,"MAX","是","(新欄位)"]
[{"$f":"_xlfn.XLOOKUP(D15,資料表及主鍵!C:C,資料表及主鍵!A:A)","v":"基本資料"},{"$f":"_xlfn.XLOOKUP(D15,資料表及主鍵!C:C,資料表及主鍵!B:B)","v":"套表列印設定"},"files.num","files","num",null,null,"否","自動編號"]
[{"$f":"_xlfn.XLOOKUP(D16,資料表及主鍵!C:C,資料表及主鍵!A:A)","v":"基本資料"},{"$f":"_xlfn.XLOOKUP(D16,資料表及主鍵!C:C,資料表及主鍵!B:B)","v":"套表列印設定"},"files.subject","files","subject",null,100,"是","文件名稱 *"]
[{"$f":"_xlfn.XLOOKUP(D17,資料表及主鍵!C:C,資料表及主鍵!A:A)","v":"基本資料"},{"$f":"_xlfn.XLOOKUP(D17,資料表及主鍵!C:C,資料表及主鍵!B:B)","v":"套表列印設定"},"files.word","files","word",null,"MAX","是","內容 *","(HTML編輯器)","以HTML編輯, 並定義套用欄位"]
[{"$f":"_xlfn.XLOOKUP(D18,資料表及主鍵!C:C,資料表及主鍵!A:A)","v":"基本資料"},{"$f":"_xlfn.XLOOKUP(D18,資料表及主鍵!C:C,資料表及主鍵!B:B)","v":"套表列印設定"},"files.reg_time","files","reg_time",null,null,"是","建立日期 *"]
[{"$f":"_xlfn.XLOOKUP(D19,資料表及主鍵!C:C,資料表及主鍵!A:A)","v":"基本資料"},{"$f":"_xlfn.XLOOKUP(D19,資料表及主鍵!C:C,資料表及主鍵!B:B)","v":"套表列印設定"},"files.modify_time","files","modify_time",null,null,"是","最後修改日期","(自動記錄)"]
[{"$f":"_xlfn.XLOOKUP(D20,資料表及主鍵!C:C,資料表及主鍵!A:A)","v":"基本資料"},{"$f":"_xlfn.XLOOKUP(D20,資料表及主鍵!C:C,資料表及主鍵!B:B)","v":"套表列印設定"},"files.customize_data","files","customize_data",null,"MAX","是","自定義欄位需求",null,"報表套印的自訂變數"]
[{"$f":"_xlfn.XLOOKUP(D21,資料表及主鍵!C:C,資料表及主鍵!A:A)","v":"基本資料"},{"$f":"_xlfn.XLOOKUP(D21,資料表及主鍵!C:C,資料表及主鍵!B:B)","v":"套表列印設定"},"files.paperset","files","paperset",null,30,"是","紙張設定",null,"紙張設定參數值"]
[{"$f":"_xlfn.XLOOKUP(D22,資料表及主鍵!C:C,資料表及主鍵!A:A)","v":"權限"},{"$f":"_xlfn.XLOOKUP(D22,資料表及主鍵!C:C,資料表及主鍵!B:B)","v":"群組資料"},"admin_group.g_name","admin_group","g_name",null,6,"否","群組代號 *"]
[{"$f":"_xlfn.XLOOKUP(D23,資料表及主鍵!C:C,資料表及主鍵!A:A)","v":"權限"},{"$f":"_xlfn.XLOOKUP(D23,資料表及主鍵!C:C,資料表及主鍵!B:B)","v":"群組資料"},"admin_group.items","admin_group","items",null,510,"是","群組權限","(多項勾選有權限的選項)","以逗點分隔多組選項編號"]
[{"$f":"_xlfn.XLOOKUP(D24,資料表及主鍵!C:C,資料表及主鍵!A:A)","v":"權限"},{"$f":"_xlfn.XLOOKUP(D24,資料表及主鍵!C:C,資料表及主鍵!B:B)","v":"群組資料"},"admin_group.demo","admin_group","demo",null,200,"是","群組名稱 *"]
[{"$f":"_xlfn.XLOOKUP(D25,資料表及主鍵!C:C,資料表及主鍵!A:A)","v":"權限"},{"$f":"_xlfn.XLOOKUP(D25,資料表及主鍵!C:C,資料表及主鍵!B:B)","v":"使用者管理"},"admin.num","admin","num",null,null,"否","自動編號"]
[{"$f":"_xlfn.XLOOKUP(D26,資料表及主鍵!C:C,資料表及主鍵!A:A)","v":"權限"},{"$f":"_xlfn.XLOOKUP(D26,資料表及主鍵!C:C,資料表及主鍵!B:B)","v":"使用者管理"},"admin.u_id","admin","u_id",null,100,"是","帳號 *"]
[{"$f":"_xlfn.XLOOKUP(D27,資料表及主鍵!C:C,資料表及主鍵!A:A)","v":"權限"},{"$f":"_xlfn.XLOOKUP(D27,資料表及主鍵!C:C,資料表及主鍵!B:B)","v":"使用者管理"},"admin.u_password","admin","u_password",null,"MAX","是","密碼 * "]
[{"$f":"_xlfn.XLOOKUP(D28,資料表及主鍵!C:C,資料表及主鍵!A:A)","v":"權限"},{"$f":"_xlfn.XLOOKUP(D28,資料表及主鍵!C:C,資料表及主鍵!B:B)","v":"使用者管理"},"admin.u_name","admin","u_name",null,100,"是","姓名 *"]
[{"$f":"_xlfn.XLOOKUP(D29,資料表及主鍵!C:C,資料表及主鍵!A:A)","v":"權限"},{"$f":"_xlfn.XLOOKUP(D29,資料表及主鍵!C:C,資料表及主鍵!B:B)","v":"使用者管理"},"admin.sex","admin","sex",null,4,"是","-"]
[{"$f":"_xlfn.XLOOKUP(D30,資料表及主鍵!C:C,資料表及主鍵!A:A)","v":"權限"},{"$f":"_xlfn.XLOOKUP(D30,資料表及主鍵!C:C,資料表及主鍵!B:B)","v":"使用者管理"},"admin.kind","admin","kind",null,20,"是","-"]
[{"$f":"_xlfn.XLOOKUP(D31,資料表及主鍵!C:C,資料表及主鍵!A:A)","v":"權限"},{"$f":"_xlfn.XLOOKUP(D31,資料表及主鍵!C:C,資料表及主鍵!B:B)","v":"使用者管理"},"admin.phone1","admin","phone1",null,100,"是","-"]
[{"$f":"_xlfn.XLOOKUP(D32,資料表及主鍵!C:C,資料表及主鍵!A:A)","v":"權限"},{"$f":"_xlfn.XLOOKUP(D32,資料表及主鍵!C:C,資料表及主鍵!B:B)","v":"使用者管理"},"admin.phone2","admin","phone2",null,100,"是","-"]
[{"$f":"_xlfn.XLOOKUP(D33,資料表及主鍵!C:C,資料表及主鍵!A:A)","v":"權限"},{"$f":"_xlfn.XLOOKUP(D33,資料表及主鍵!C:C,資料表及主鍵!B:B)","v":"使用者管理"},"admin.birthday","admin","birthday",null,null,"是","-"]
[{"$f":"_xlfn.XLOOKUP(D34,資料表及主鍵!C:C,資料表及主鍵!A:A)","v":"權限"},{"$f":"_xlfn.XLOOKUP(D34,資料表及主鍵!C:C,資料表及主鍵!B:B)","v":"使用者管理"},"admin.email","admin","email",null,400,"是","-"]
[{"$f":"_xlfn.XLOOKUP(D35,資料表及主鍵!C:C,資料表及主鍵!A:A)","v":"權限"},{"$f":"_xlfn.XLOOKUP(D35,資料表及主鍵!C:C,資料表及主鍵!B:B)","v":"使用者管理"},"admin.city","admin","city",null,20,"是","-"]
[{"$f":"_xlfn.XLOOKUP(D36,資料表及主鍵!C:C,資料表及主鍵!A:A)","v":"權限"},{"$f":"_xlfn.XLOOKUP(D36,資料表及主鍵!C:C,資料表及主鍵!B:B)","v":"使用者管理"},"admin.area","admin","area",null,100,"是","-"]
[{"$f":"_xlfn.XLOOKUP(D37,資料表及主鍵!C:C,資料表及主鍵!A:A)","v":"權限"},{"$f":"_xlfn.XLOOKUP(D37,資料表及主鍵!C:C,資料表及主鍵!B:B)","v":"使用者管理"},"admin.address","admin","address",null,510,"是","-"]
[{"$f":"_xlfn.XLOOKUP(D38,資料表及主鍵!C:C,資料表及主鍵!A:A)","v":"權限"},{"$f":"_xlfn.XLOOKUP(D38,資料表及主鍵!C:C,資料表及主鍵!B:B)","v":"使用者管理"},"admin.uid","admin","uid",null,40,"是","-"]
[{"$f":"_xlfn.XLOOKUP(D39,資料表及主鍵!C:C,資料表及主鍵!A:A)","v":"權限"},{"$f":"_xlfn.XLOOKUP(D39,資料表及主鍵!C:C,資料表及主鍵!B:B)","v":"使用者管理"},"admin.demo","admin","demo",null,"MAX","是","-"]
[{"$f":"_xlfn.XLOOKUP(D40,資料表及主鍵!C:C,資料表及主鍵!A:A)","v":"權限"},{"$f":"_xlfn.XLOOKUP(D40,資料表及主鍵!C:C,資料表及主鍵!B:B)","v":"使用者管理"},"admin.power","admin","power",null,6,"是","所屬群組 *","查詢:群組"]
[{"$f":"_xlfn.XLOOKUP(D41,資料表及主鍵!C:C,資料表及主鍵!A:A)","v":"權限"},{"$f":"_xlfn.XLOOKUP(D41,資料表及主鍵!C:C,資料表及主鍵!B:B)","v":"使用者管理"},"admin.online","admin","online",null,null,"否","狀態 *","啟用/停權"]
[{"$f":"_xlfn.XLOOKUP(D42,資料表及主鍵!C:C,資料表及主鍵!A:A)","v":"權限"},{"$f":"_xlfn.XLOOKUP(D42,資料表及主鍵!C:C,資料表及主鍵!B:B)","v":"使用者管理"},"admin.reg_time","admin","reg_time",null,null,"是","登錄時間"]
[{"$f":"_xlfn.XLOOKUP(D43,資料表及主鍵!C:C,資料表及主鍵!A:A)","v":"權限"},{"$f":"_xlfn.XLOOKUP(D43,資料表及主鍵!C:C,資料表及主鍵!B:B)","v":"使用者管理"},"admin.login_time","admin","login_time",null,null,"是","最近登入時間"]
[{"$f":"_xlfn.XLOOKUP(D44,資料表及主鍵!C:C,資料表及主鍵!A:A)","v":"權限"},{"$f":"_xlfn.XLOOKUP(D44,資料表及主鍵!C:C,資料表及主鍵!B:B)","v":"使用者管理"},"admin.login_ip","admin","login_ip",null,100,"是","最近登入IP"]
[{"$f":"_xlfn.XLOOKUP(D45,資料表及主鍵!C:C,資料表及主鍵!A:A)","v":"權限"},{"$f":"_xlfn.XLOOKUP(D45,資料表及主鍵!C:C,資料表及主鍵!B:B)","v":"使用者管理"},"admin.login_code","admin","login_code",null,20,"是","-"]
[{"$f":"_xlfn.XLOOKUP(D46,資料表及主鍵!C:C,資料表及主鍵!A:A)","v":"權限"},{"$f":"_xlfn.XLOOKUP(D46,資料表及主鍵!C:C,資料表及主鍵!B:B)","v":"使用者管理"},"admin.adwidth","admin","adwidth",null,20,"是","-"]
[{"$f":"_xlfn.XLOOKUP(D47,資料表及主鍵!C:C,資料表及主鍵!A:A)","v":"權限"},{"$f":"_xlfn.XLOOKUP(D47,資料表及主鍵!C:C,資料表及主鍵!B:B)","v":"使用者管理"},"admin.wrp_news","admin","wrp_news",null,2,"是","-"]
[{"$f":"_xlfn.XLOOKUP(D48,資料表及主鍵!C:C,資料表及主鍵!A:A)","v":"權限"},{"$f":"_xlfn.XLOOKUP(D48,資料表及主鍵!C:C,資料表及主鍵!B:B)","v":"使用者管理"},"admin.wrp_bar","admin","wrp_bar",null,2,"是","-"]
[{"$f":"_xlfn.XLOOKUP(D49,資料表及主鍵!C:C,資料表及主鍵!A:A)","v":"權限"},{"$f":"_xlfn.XLOOKUP(D49,資料表及主鍵!C:C,資料表及主鍵!B:B)","v":"使用者管理"},"admin.gauth_key","admin","gauth_key","nvarchar","MAX","是","Google 驗證綁定碼"]
[{"$f":"_xlfn.XLOOKUP(D50,資料表及主鍵!C:C,資料表及主鍵!A:A)","v":"權限"},{"$f":"_xlfn.XLOOKUP(D50,資料表及主鍵!C:C,資料表及主鍵!B:B)","v":"使用者管理"},"admin.gauth_enabled","admin","gauth_enabled","bit",null,"是","Google 驗證啟用","(勾選)"]
[{"$f":"_xlfn.XLOOKUP(D51,資料表及主鍵!C:C,資料表及主鍵!A:A)","v":"選項"},{"$f":"_xlfn.XLOOKUP(D51,資料表及主鍵!C:C,資料表及主鍵!B:B)","v":"縣市資料檔"},"PostCity.city","PostCity","city","nvarchar",20,"是","縣市名稱"]
[{"$f":"_xlfn.XLOOKUP(D52,資料表及主鍵!C:C,資料表及主鍵!A:A)","v":"庫存"},{"$f":"_xlfn.XLOOKUP(D52,資料表及主鍵!C:C,資料表及主鍵!B:B)","v":"庫存管理-檔案附件"},"stock_files.num","stock_files","num","int",null,"否","自動編號"]
[{"$f":"_xlfn.XLOOKUP(D53,資料表及主鍵!C:C,資料表及主鍵!A:A)","v":"庫存"},{"$f":"_xlfn.XLOOKUP(D53,資料表及主鍵!C:C,資料表及主鍵!B:B)","v":"庫存管理-檔案附件"},"stock_files.stock_num","stock_files","stock_num","int",null,"是","庫存記錄編號","主檔/明細關聯:庫存管理主檔"]
[{"$f":"_xlfn.XLOOKUP(D54,資料表及主鍵!C:C,資料表及主鍵!A:A)","v":"庫存"},{"$f":"_xlfn.XLOOKUP(D54,資料表及主鍵!C:C,資料表及主鍵!B:B)","v":"庫存管理-檔案附件"},"stock_files.reg_time","stock_files","reg_time","datetime",null,"是","登錄時間"]
[{"$f":"_xlfn.XLOOKUP(D55,資料表及主鍵!C:C,資料表及主鍵!A:A)","v":"庫存"},{"$f":"_xlfn.XLOOKUP(D55,資料表及主鍵!C:C,資料表及主鍵!B:B)","v":"庫存管理-檔案附件"},"stock_files.pic1","stock_files","pic1","nvarchar",100,"是","圖檔/檔名"]
[{"$f":"_xlfn.XLOOKUP(D56,資料表及主鍵!C:C,資料表及主鍵!A:A)","v":"庫存"},{"$f":"_xlfn.XLOOKUP(D56,資料表及主鍵!C:C,資料表及主鍵!B:B)","v":"庫存管理-檔案附件"},"stock_files.pic1_name","stock_files","pic1_name","nvarchar",300,"是","原始圖檔/檔名"]
[{"$f":"_xlfn.XLOOKUP(D57,資料表及主鍵!C:C,資料表及主鍵!A:A)","v":"掛單"},{"$f":"_xlfn.XLOOKUP(D57,資料表及主鍵!C:C,資料表及主鍵!B:B)","v":"房間管理主檔"},"bed_kind.num","bed_kind","num","int",null,"否","自動編號"]
[{"$f":"_xlfn.XLOOKUP(D58,資料表及主鍵!C:C,資料表及主鍵!A:A)","v":"掛單"},{"$f":"_xlfn.XLOOKUP(D58,資料表及主鍵!C:C,資料表及主鍵!B:B)","v":"房間管理主檔"},"bed_kind.kind","bed_kind","kind","nvarchar",200,"是","樓層/房間名稱 *"]
[{"$f":"_xlfn.XLOOKUP(D59,資料表及主鍵!C:C,資料表及主鍵!A:A)","v":"掛單"},{"$f":"_xlfn.XLOOKUP(D59,資料表及主鍵!C:C,資料表及主鍵!B:B)","v":"房間管理主檔"},"bed_kind.root","bed_kind","root","int",null,"是","上層編號"]
[{"$f":"_xlfn.XLOOKUP(D60,資料表及主鍵!C:C,資料表及主鍵!A:A)","v":"掛單"},{"$f":"_xlfn.XLOOKUP(D60,資料表及主鍵!C:C,資料表及主鍵!B:B)","v":"房間管理主檔"},"bed_kind.range","bed_kind","range","int",null,"是","-"]
{"$rows_left_out":398}
{"sheet":"工作表2","index":4,"n_rows":457,"n_cols":9,"rows_kept":457}
[null,null,"資料表名稱","欄位名稱","資料型態","最大長度","可為空值"]
["CHK","Table.Column","TableName","ColumnName","DataType","Size","IsNullable","ForeignKeyName","ReferencedTableName"]
[{"$f":"_xludf.XLOOKUP(B3,資料欄位列表!C:C,資料欄位列表!C:C,\"\")","v":{"$error":"#NAME?"}},{"$f":"C3&\".\"&D3","v":"accounting.num"},"accounting","num","int",null,"否"]
[{"$f":"_xludf.XLOOKUP(B4,資料欄位列表!C:C,資料欄位列表!C:C,\"\")","v":{"$error":"#NAME?"}},"accounting.uptime","accounting","uptime","datetime",null,"是"]
[{"$f":"_xludf.XLOOKUP(B5,資料欄位列表!C:C,資料欄位列表!C:C,\"\")","v":{"$error":"#NAME?"}},"accounting.category","accounting","category","int",null,"是"]
[{"$f":"_xludf.XLOOKUP(B6,資料欄位列表!C:C,資料欄位列表!C:C,\"\")","v":{"$error":"#NAME?"}},"accounting.kind","accounting","kind","int",null,"是","FK_accounting_accounting_kind","accounting_kind"]
[{"$f":"_xludf.XLOOKUP(B7,資料欄位列表!C:C,資料欄位列表!C:C,\"\")","v":{"$error":"#NAME?"}},"accounting.kind2","accounting","kind2","int",null,"是","FK_accounting_accounting_kind2","accounting_kind2"]
[{"$f":"_xludf.XLOOKUP(B8,資料欄位列表!C:C,資料欄位列表!C:C,\"\")","v":{"$error":"#NAME?"}},"accounting.price","accounting","price","real",null,"是"]
[{"$f":"_xludf.XLOOKUP(B9,資料欄位列表!C:C,資料欄位列表!C:C,\"\")","v":{"$error":"#NAME?"}},"accounting.tax","accounting","tax","real",null,"是"]
[{"$f":"_xludf.XLOOKUP(B10,資料欄位列表!C:C,資料欄位列表!C:C,\"\")","v":{"$error":"#NAME?"}},"accounting.demo","accounting","demo","nvarchar","MAX","是"]
[{"$f":"_xludf.XLOOKUP(B11,資料欄位列表!C:C,資料欄位列表!C:C,\"\")","v":{"$error":"#NAME?"}},"accounting.mem_num","accounting","mem_num","int",null,"是","FK_accounting_member","member"]
[{"$f":"_xludf.XLOOKUP(B12,資料欄位列表!C:C,資料欄位列表!C:C,\"\")","v":{"$error":"#NAME?"}},"accounting.debtor","accounting","debtor","nvarchar",40,"是"]
[{"$f":"_xludf.XLOOKUP(B13,資料欄位列表!C:C,資料欄位列表!C:C,\"\")","v":{"$error":"#NAME?"}},"accounting.activity_num","accounting","activity_num","int",null,"是","FK_accounting_activity","activity"]
[{"$f":"_xludf.XLOOKUP(B14,資料欄位列表!C:C,資料欄位列表!C:C,\"\")","v":{"$error":"#NAME?"}},"accounting.excerpt","accounting","excerpt","nvarchar","MAX","是"]
["*","accounting.reg_time","accounting","reg_time","datetime",null,"是"]
[{"$f":"_xludf.XLOOKUP(B16,資料欄位列表!C:C,資料欄位列表!C:C,\"\")","v":{"$error":"#NAME?"}},"accounting_files.num","accounting_files","num","int",null,"否"]
[{"$f":"_xludf.XLOOKUP(B17,資料欄位列表!C:C,資料欄位列表!C:C,\"\")","v":{"$error":"#NAME?"}},"accounting_files.accounting_num","accounting_files","accounting_num","int",null,"是","FK_accounting_files_accounting","accounting"]
[{"$f":"_xludf.XLOOKUP(B18,資料欄位列表!C:C,資料欄位列表!C:C,\"\")","v":{"$error":"#NAME?"}},"accounting_files.reg_time","accounting_files","reg_time","datetime",null,"是"]
[{"$f":"_xludf.XLOOKUP(B19,資料欄位列表!C:C,資料欄位列表!C:C,\"\")","v":{"$error":"#NAME?"}},"accounting_files.pic1","accounting_files","pic1","nvarchar",100,"是"]
[{"$f":"_xludf.XLOOKUP(B20,資料欄位列表!C:C,資料欄位列表!C:C,\"\")","v":{"$error":"#NAME?"}},"accounting_files.pic1_name","accounting_files","pic1_name","nvarchar",300,"是"]
[{"$f":"_xludf.XLOOKUP(B21,資料欄位列表!C:C,資料欄位列表!C:C,\"\")","v":{"$error":"#NAME?"}},"accounting_kind.num","accounting_kind","num","int",null,"否"]
[{"$f":"_xludf.XLOOKUP(B22,資料欄位列表!C:C,資料欄位列表!C:C,\"\")","v":{"$error":"#NAME?"}},"accounting_kind.kind","accounting_kind","kind","nvarchar",200,"是"]
[{"$f":"_xludf.XLOOKUP(B23,資料欄位列表!C:C,資料欄位列表!C:C,\"\")","v":{"$error":"#NAME?"}},"accounting_kind.root","accounting_kind","root","int",null,"是"]
[{"$f":"_xludf.XLOOKUP(B24,資料欄位列表!C:C,資料欄位列表!C:C,\"\")","v":{"$error":"#NAME?"}},"accounting_kind.range","accounting_kind","range","int",null,"是"]
[{"$f":"_xludf.XLOOKUP(B25,資料欄位列表!C:C,資料欄位列表!C:C,\"\")","v":{"$error":"#NAME?"}},"accounting_kind.demo","accounting_kind","demo","nvarchar","MAX","是"]
[{"$f":"_xludf.XLOOKUP(B26,資料欄位列表!C:C,資料欄位列表!C:C,\"\")","v":{"$error":"#NAME?"}},"accounting_kind.title","accounting_kind","title","nvarchar",60,"是"]
[{"$f":"_xludf.XLOOKUP(B27,資料欄位列表!C:C,資料欄位列表!C:C,\"\")","v":{"$error":"#NAME?"}},"accounting_kind2.num","accounting_kind2","num","int",null,"否"]
[{"$f":"_xludf.XLOOKUP(B28,資料欄位列表!C:C,資料欄位列表!C:C,\"\")","v":{"$error":"#NAME?"}},"accounting_kind2.kind","accounting_kind2","kind","nvarchar",200,"是"]
[{"$f":"_xludf.XLOOKUP(B29,資料欄位列表!C:C,資料欄位列表!C:C,\"\")","v":{"$error":"#NAME?"}},"accounting_kind2.root","accounting_kind2","root","int",null,"是"]
[{"$f":"_xludf.XLOOKUP(B30,資料欄位列表!C:C,資料欄位列表!C:C,\"\")","v":{"$error":"#NAME?"}},"accounting_kind2.range","accounting_kind2","range","int",null,"是"]
[{"$f":"_xludf.XLOOKUP(B31,資料欄位列表!C:C,資料欄位列表!C:C,\"\")","v":{"$error":"#NAME?"}},"accounting_kind2.demo","accounting_kind2","demo","nvarchar","MAX","是"]
[{"$f":"_xludf.XLOOKUP(B32,資料欄位列表!C:C,資料欄位列表!C:C,\"\")","v":{"$error":"#NAME?"}},"accounting_kind2.title","accounting_kind2","title","nvarchar",60,"是"]
[{"$f":"_xludf.XLOOKUP(B33,資料欄位列表!C:C,資料欄位列表!C:C,\"\")","v":{"$error":"#NAME?"}},"accounting_kind2.bank_name","accounting_kind2","bank_name","nvarchar",60,"是"]
[{"$f":"_xludf.XLOOKUP(B34,資料欄位列表!C:C,資料欄位列表!C:C,\"\")","v":{"$error":"#NAME?"}},"accounting_kind2.bank_code","accounting_kind2","bank_code","nvarchar",60,"是"]
[{"$f":"_xludf.XLOOKUP(B35,資料欄位列表!C:C,資料欄位列表!C:C,\"\")","v":{"$error":"#NAME?"}},"accounting_kind2.bank_id","accounting_kind2","bank_id","nvarchar",60,"是"]
["*","accounting_kind2.record_payment","accounting_kind2","record_payment","nvarchar",2,"是"]
[{"$f":"_xludf.XLOOKUP(B37,資料欄位列表!C:C,資料欄位列表!C:C,\"\")","v":{"$error":"#NAME?"}},"act_bom.num","act_bom","num","int",null,"否"]
[{"$f":"_xludf.XLOOKUP(B38,資料欄位列表!C:C,資料欄位列表!C:C,\"\")","v":{"$error":"#NAME?"}},"act_bom.package_num","act_bom","package_num","int",null,"是","FK_act_bom_act_bom","act_bom"]
[{"$f":"_xludf.XLOOKUP(B39,資料欄位列表!C:C,資料欄位列表!C:C,\"\")","v":{"$error":"#NAME?"}},"act_bom.item_num","act_bom","item_num","int",null,"是","FK_act_bom_actItem1","actItem"]
[{"$f":"_xludf.XLOOKUP(B40,資料欄位列表!C:C,資料欄位列表!C:C,\"\")","v":{"$error":"#NAME?"}},"act_bom.item_type","act_bom","item_type","int",null,"是"]
[{"$f":"_xludf.XLOOKUP(B41,資料欄位列表!C:C,資料欄位列表!C:C,\"\")","v":{"$error":"#NAME?"}},"act_bom.group_name","act_bom","group_name","nvarchar",200,"是"]
[{"$f":"_xludf.XLOOKUP(B42,資料欄位列表!C:C,資料欄位列表!C:C,\"\")","v":{"$error":"#NAME?"}},"act_bom.optional","act_bom","optional","bit",null,"是"]
[{"$f":"_xludf.XLOOKUP(B43,資料欄位列表!C:C,資料欄位列表!C:C,\"\")","v":{"$error":"#NAME?"}},"act_bom.qty","act_bom","qty","int",null,"是"]
[{"$f":"_xludf.XLOOKUP(B44,資料欄位列表!C:C,資料欄位列表!C:C,\"\")","v":{"$error":"#NAME?"}},"act_bom.memo","act_bom","memo","nvarchar","MAX","是"]
[{"$f":"_xludf.XLOOKUP(B45,資料欄位列表!C:C,資料欄位列表!C:C,\"\")","v":{"$error":"#NAME?"}},"actItem.num","actItem","num","int",null,"否"]
[{"$f":"_xludf.XLOOKUP(B46,資料欄位列表!C:C,資料欄位列表!C:C,\"\")","v":{"$error":"#NAME?"}},"actItem.partno","actItem","partno","nvarchar",200,"是"]
[{"$f":"_xludf.XLOOKUP(B47,資料欄位列表!C:C,資料欄位列表!C:C,\"\")","v":{"$error":"#NAME?"}},"actItem.subject","actItem","subject","nvarchar",200,"是"]
[{"$f":"_xludf.XLOOKUP(B48,資料欄位列表!C:C,資料欄位列表!C:C,\"\")","v":{"$error":"#NAME?"}},"actItem.kind","actItem","kind","int",null,"是","FK_actItem_actItem_kind","actItem_kind"]
[{"$f":"_xludf.XLOOKUP(B49,資料欄位列表!C:C,資料欄位列表!C:C,\"\")","v":{"$error":"#NAME?"}},"actItem.price","actItem","price","real",null,"是"]
[{"$f":"_xludf.XLOOKUP(B50,資料欄位列表!C:C,資料欄位列表!C:C,\"\")","v":{"$error":"#NAME?"}},"actItem.status","actItem","status","nvarchar",2,"是"]
[{"$f":"_xludf.XLOOKUP(B51,資料欄位列表!C:C,資料欄位列表!C:C,\"\")","v":{"$error":"#NAME?"}},"actItem.demo","actItem","demo","nvarchar","MAX","是"]
[{"$f":"_xludf.XLOOKUP(B52,資料欄位列表!C:C,資料欄位列表!C:C,\"\")","v":{"$error":"#NAME?"}},"actItem.extend","actItem","extend","nvarchar",2,"是"]
[{"$f":"_xludf.XLOOKUP(B53,資料欄位列表!C:C,資料欄位列表!C:C,\"\")","v":{"$error":"#NAME?"}},"actItem.cycle","actItem","cycle","int",null,"是"]
[{"$f":"_xludf.XLOOKUP(B54,資料欄位列表!C:C,資料欄位列表!C:C,\"\")","v":{"$error":"#NAME?"}},"actItem.category","actItem","category","int",null,"是"]
[{"$f":"_xludf.XLOOKUP(B55,資料欄位列表!C:C,資料欄位列表!C:C,\"\")","v":{"$error":"#NAME?"}},"actItem.customize_data","actItem","customize_data","nvarchar","MAX","是"]
[{"$f":"_xludf.XLOOKUP(B56,資料欄位列表!C:C,資料欄位列表!C:C,\"\")","v":{"$error":"#NAME?"}},"actItem.reg_time","actItem","reg_time","datetime",null,"是"]
[{"$f":"_xludf.XLOOKUP(B57,資料欄位列表!C:C,資料欄位列表!C:C,\"\")","v":{"$error":"#NAME?"}},"actItem_files.num","actItem_files","num","int",null,"否"]
[{"$f":"_xludf.XLOOKUP(B58,資料欄位列表!C:C,資料欄位列表!C:C,\"\")","v":{"$error":"#NAME?"}},"actItem_files.actItem_num","actItem_files","actItem_num","int",null,"否","FK_actItem_files_actItem","actItem"]
[{"$f":"_xludf.XLOOKUP(B59,資料欄位列表!C:C,資料欄位列表!C:C,\"\")","v":{"$error":"#NAME?"}},"actItem_files.files_num","actItem_files","files_num","int",null,"否","FK_actItem_files_files","files"]
[{"$f":"_xludf.XLOOKUP(B60,資料欄位列表!C:C,資料欄位列表!C:C,\"\")","v":{"$error":"#NAME?"}},"actItem_files.reg_time","actItem_files","reg_time","datetime",null,"是"]
{"$rows_left_out":398}
{"sheet":"memo","index":5,"n_rows":5,"n_cols":2,"rows_kept":5,"hidden":true}
["LIST TABLES AND PK"]
[null,"SELECT tab.TABLE_NAME, tab.CONSTRAINT_NAME, Col.Column_Name from \n    INFORMATION_SCHEMA.TABLE_CONSTRAINTS Tab, \n    INFORMATION_SCHEMA.CONSTRAINT_COLUMN_USAGE Col \nWHERE \n    Col.Constraint_Name = Tab.Constraint_Name\n    AND Col.Table_Name = Tab.Table_Name\n    AND Tab.Constraint_Type = 'PRIMARY KEY'\nORDER BY TABLE_NAME"]
[]
[]
[null,"SELECT \n    c.name 'Column Name',\n    t.Name 'Data type',\n    c.max_length 'Max Length',\n    c.precision ,\n    c.scale ,\n    c.is_nullable,\n    ISNULL(i.is_primary_key, 0) 'Primary Key'\nFROM    \n    sys.columns c\nINNER JOIN \n    sys.types t ON c.user_type_id = t.user_type_id\nLEFT OUTER JOIN \n    sys.index_columns ic ON ic.object_id = c.object_id AND ic.column_id = c.column_id\nLEFT OUTER JOIN \n    sys.indexes i ON ic.object_id = i.object_id AND ic.index_id = i.index_id\nWHERE\n    c.object_id = OBJECT_ID('YourTableName')"]